Reaction Details
TargetCollagenase 3
LigandBDBM50103162
Substrate/Competitorn/a
Meas. Tech.ChEBML_106636
IC50 1±n/a nM
Citation Levin, JIChen, JDu, MHogan, MKincaid, SNelson, FCVenkatesan, AMWehr, TZask, ADiJoseph, JKillar, LMSkala, SSung, ASharr, MRoth, CJin, GCowling, RMohler, KMBlack, RAMarch, CJSkotnicki, JS The discovery of anthranilic acid-based MMP inhibitors. Part 2: SAR of the 5-position and P1(1) groups. Bioorg Med Chem Lett11:2189-92 (2001) Collagenase 3
Name:Collagenase 3
Type:Enzyme
Mol. Mass.:53808.06
Organism:Homo sapiens (Human)
Description:P45452
Residue:471
BDBM50103162
NameBDBM50103162
Synonyms:CHEMBL68542 | N-Hydroxy-2-[(4-methoxy-benzenesulfonyl)-pyridin-3-ylmethyl-amino]-3-methyl-5-naphthalen-2-yl-benzamide
TypeSmall organic molecule
Emp. Form.C31H27N3O5S
Mol. Mass.553.628
SMILESCOc1ccc(cc1)S(=O)(=O)N(Cc1cccnc1)c1c(C)cc(cc1C(=O)NO)-c1ccc2ccccc2c1