Reaction Details
TargetGenome polyprotein
LigandBDBM50366760
Substrate/Competitorn/a
Meas. Tech.ChEMBL_143618 (CHEMBL751678)
Ki 0.750000±n/a nM
Citation Johansson, AHubatsch, IAkerblom, ELindeberg, GWiniwarter, SDanielson, UHHallberg, A Inhibition of hepatitis C virus NS3 protease activity by product-based peptides is dependent on helicase domain. Bioorg Med Chem Lett11:203-6 (2001) Genome polyprotein
Name:Genome polyprotein
Type:Protein
Mol. Mass.:67067.41
Organism:Hepatitis C virus
Description:A3EZI9
Residue:631
BDBM50366760
NameBDBM50366760
Synonyms:CHEMBL2369589
TypeSmall organic molecule
Emp. Form.C36H58N6O14S
Mol. Mass.830.943
SMILESCC[C@H](C)[C@H](NC(=O)[C@H](CC(C)C)NC(=O)[C@@H](CC(C(O)=O)C(O)=O)NC(=O)[C@H](CC(O)=O)NC(C)=O)C(=O)N[C@@H](CC1CCCCC1)C(=O)N[C@@H](CS)C(O)=O