Reaction Details
TargetDisintegrin and metalloproteinase domain-containing protein 17
LigandBDBM50096472
Substrate/Competitorn/a
Meas. Tech.ChEBML_206021
IC50 81±n/a nM
Citation Levin, JIDu, MTDiJoseph, JFKillar, LMSung, AWalter, TSharr, MARoth, CEMoy, FJPowers, RJin, GCowling, RSkotnicki, JS The discovery of anthranilic acid-based MMP inhibitors. Part 1: SAR of the 3-position. Bioorg Med Chem Lett11:235-8 (2001) Disintegrin and metalloproteinase domain-containing protein 17
Name:Disintegrin and metalloproteinase domain-containing protein 17
Type:Enzyme
Mol. Mass.:93007.89
Organism:Homo sapiens (Human)
Description:
Residue:824
BDBM50096472
NameBDBM50096472
Synonyms:2-(N-benzyl-4-methoxyphenylsulfonamido)-N-hydroxy-3-(2-(hydroxyamino)-2-oxoethoxy)benzamide CHEMBL80272
TypeSmall organic molecule
Emp. Form.C23H23N3O8S
Mol. Mass.501.509
SMILESCOc1ccc(cc1)S(=O)(=O)N(Cc1ccccc1)c1c(OCC(=O)NO)cccc1C(=O)NO