Reaction Details
TargetInterstitial collagenase
LigandBDBM50096472
Substrate/Competitorn/a
Meas. Tech.ChEBML_105948
IC50 24±n/a nM
Citation Levin, JIDu, MTDiJoseph, JFKillar, LMSung, AWalter, TSharr, MARoth, CEMoy, FJPowers, RJin, GCowling, RSkotnicki, JS The discovery of anthranilic acid-based MMP inhibitors. Part 1: SAR of the 3-position. Bioorg Med Chem Lett11:235-8 (2001) Interstitial collagenase
Name:Interstitial collagenase
Type:Enzyme
Mol. Mass.:54010.26
Organism:Homo sapiens (Human)
Description: P03956
Residue:469
BDBM50096472
NameBDBM50096472
Synonyms:2-(N-benzyl-4-methoxyphenylsulfonamido)-N-hydroxy-3-(2-(hydroxyamino)-2-oxoethoxy)benzamide CHEMBL80272
TypeSmall organic molecule
Emp. Form.C23H23N3O8S
Mol. Mass.501.509
SMILESCOc1ccc(cc1)S(=O)(=O)N(Cc1ccccc1)c1c(OCC(=O)NO)cccc1C(=O)NO