Reaction Details
TargetMatrix metalloproteinase-9
LigandBDBM50096472
Substrate/Competitorn/a
Meas. Tech.ChEBML_105222
IC50 2±n/a nM
Citation Levin, JIDu, MTDiJoseph, JFKillar, LMSung, AWalter, TSharr, MARoth, CEMoy, FJPowers, RJin, GCowling, RSkotnicki, JS The discovery of anthranilic acid-based MMP inhibitors. Part 1: SAR of the 3-position. Bioorg Med Chem Lett11:235-8 (2001) Matrix metalloproteinase-9
Name:Matrix metalloproteinase-9
Type:Enzyme
Mol. Mass.:78452.28
Organism:Homo sapiens (Human)
Description:P14780
Residue:707
BDBM50096472
NameBDBM50096472
Synonyms:2-(N-benzyl-4-methoxyphenylsulfonamido)-N-hydroxy-3-(2-(hydroxyamino)-2-oxoethoxy)benzamide CHEMBL80272
TypeSmall organic molecule
Emp. Form.C23H23N3O8S
Mol. Mass.501.509
SMILESCOc1ccc(cc1)S(=O)(=O)N(Cc1ccccc1)c1c(OCC(=O)NO)cccc1C(=O)NO