Reaction Details
TargetReverse transcriptase/RNaseH
LigandBDBM50105586
Substrate/Competitorn/a
Meas. Tech.ChEBML_80619
IC50 45500±n/a nM
Citation Tillekeratne, LMSherette, AGrossman, PHupe, LHupe, DHudson, RA Simplified catechin-gallate inhibitors of HIV-1 reverse transcriptase. Bioorg Med Chem Lett11:2763-7 (2001) Reverse transcriptase/RNaseH
Name:Reverse transcriptase/RNaseH
Type:PROTEIN
Mol. Mass.:65229.15
Organism:Human immunodeficiency virus 1
Description:ChEMBL_1473730
Residue:566
BDBM50105586
NameBDBM50105586
Synonyms:2,3,4-Trihydroxy-benzoic acid 5-hydroxy-chroman-3-yl ester | CHEMBL93130
TypeSmall organic molecule
Emp. Form.C16H14O7
Mol. Mass.318.2782
SMILESOc1ccc(C(=O)OC2COc3cccc(O)c3C2)c(O)c1O