Reaction Details
TargetReverse transcriptase/RNaseH
LigandBDBM50105592
Substrate/Competitorn/a
Meas. Tech.ChEBML_80619
IC50 10740±n/a nM
Citation Tillekeratne, LMSherette, AGrossman, PHupe, LHupe, DHudson, RA Simplified catechin-gallate inhibitors of HIV-1 reverse transcriptase. Bioorg Med Chem Lett11:2763-7 (2001) Reverse transcriptase/RNaseH
Name:Reverse transcriptase/RNaseH
Type:PROTEIN
Mol. Mass.:65229.15
Organism:Human immunodeficiency virus 1
Description:ChEMBL_1473730
Residue:566
BDBM50105592
NameBDBM50105592
Synonyms:2,3,4-Trihydroxy-benzoic acid 2-(6,7-dihydroxy-chroman-3-yl)-ethyl ester | CHEMBL92138
TypeSmall organic molecule
Emp. Form.C18H18O8
Mol. Mass.362.3307
SMILESOc1ccc(C(=O)OCCC2COc3cc(O)c(O)cc3C2)c(O)c1O