Reaction Details
TargetGag-Pol polyprotein [489-587]
LigandBDBM50105590
Substrate/Competitorn/a
Meas. Tech.ChEBML_80617
IC50>100000±n/a nM
Citation Tillekeratne, LMSherette, AGrossman, PHupe, LHupe, DHudson, RA Simplified catechin-gallate inhibitors of HIV-1 reverse transcriptase. Bioorg Med Chem Lett11:2763-7 (2001) Gag-Pol polyprotein [489-587]
Name:Gag-Pol polyprotein [489-587]
Type:Enzyme Subunit
Mol. Mass.:10781.16
Organism:Human immunodeficiency virus type 1
Description:P04585[489-587]
Residue:99
BDBM50105590
NameBDBM50105590
Synonyms:2,3-Dihydroxy-benzoic acid 5,7-dihydroxy-chroman-3-yl ester | CHEMBL96112
TypeSmall organic molecule
Emp. Form.C16H14O7
Mol. Mass.318.2782
SMILESOc1cc(O)c2CC(COc2c1)OC(=O)c1cccc(O)c1O