Reaction Details
TargetReverse transcriptase/RNaseH
LigandBDBM2337
Substrate/Competitorn/a
Meas. Tech.ChEBML_197268
EC50 20±n/a nM
Citation Wang, DPRizzo, RCTirado-Rives, JJorgensen, WL Antiviral drug design: computational analyses of the effects of the L100I mutation for HIV-RT on the binding of NNRTIs. Bioorg Med Chem Lett11:2799-802 (2001) Reverse transcriptase/RNaseH
Name:Reverse transcriptase/RNaseH
Type:PROTEIN
Mol. Mass.:65229.15
Organism:Human immunodeficiency virus 1
Description:ChEMBL_1473730
Residue:566
BDBM2337
NameBDBM2337
Synonyms:6-benzyl-1-(ethoxymethyl)-5-(propan-2-yl)-1,2,3,4-tetrahydropyrimidine-2,4-dione Coactinon Emivirine (EMV) I-EBU | MKC-442
TypeSmall organic molecule
Emp. Form.C17H22N2O3
Mol. Mass.302.3682
SMILESCCOCn1c(Cc2ccccc2)c(C(C)C)c(=O)[nH]c1=O