Reaction Details
TargetDelta-type opioid receptor
LigandBDBM50105779
Substrate/Competitorn/a
Meas. Tech.ChEBML_147336
Ki 3400±n/a nM
Citation Ullrich, TDersch, CMRothman, RBJacobson, AERice, KC Derivatives of 17-(2-methylallyl)-substituted noroxymorphone: variation of the delta address and its effects on affinity and selectivity for the delta opioid receptor. Bioorg Med Chem Lett11:2883-5 (2001) Delta-type opioid receptor
Name:Delta-type opioid receptor
Type:G Protein-Coupled Receptor (GPCR)
Mol. Mass.:40382.98
Organism:Homo sapiens (Human)
Description:Competition binding assays were carried out using membrane preparations from transfected HN9.10 cells that constitutively expressed the delta opioid receptor.
Residue:372
BDBM50105779
NameBDBM50105779
Synonyms:17-hydroxy-10-methoxy-4-(2-methylallyl)-15-[1-phenyl-(E)-methylidene]-(13R,17S)-12-oxa-4-azapentacyclo[9.6.1.01,13.05,17.07,18]octadeca-7(18),8,10-trien-14-one | CHEMBL319589
TypeSmall organic molecule
Emp. Form.C28H29NO4
Mol. Mass.443.5342
SMILESCOc1ccc2CC3N(CC(C)=C)CCC45[C@@H](Oc1c24)C(=O)C(C[C@@]35O)=Cc1ccccc1