Reaction Details
TargetKappa-type opioid receptor
LigandBDBM50105771
Substrate/Competitorn/a
Meas. Tech.ChEBML_145958
Ki 3200±n/a nM
Citation Ullrich, TDersch, CMRothman, RBJacobson, AERice, KC Derivatives of 17-(2-methylallyl)-substituted noroxymorphone: variation of the delta address and its effects on affinity and selectivity for the delta opioid receptor. Bioorg Med Chem Lett11:2883-5 (2001) Kappa-type opioid receptor
Name:Kappa-type opioid receptor
Type:G Protein-Coupled Receptor (GPCR)
Mol. Mass.:42648.76
Organism:Homo sapiens (Human)
Description:P41145
Residue:380
BDBM50105771
NameBDBM50105771
Synonyms:6-(4-chlorophenyl)-13-methoxy-19-(2-methylallyl)-(2S,10R)-11-oxa-8,19-diazahexacyclo[10.9.1.01,10.02,18.04,9.016,22]docosa-4(9),5,7,12,14,16(22)-hexaen-2-ol Naltrindole analogue
TypeSmall organic molecule
Emp. Form.C30H29ClN2O3
Mol. Mass.501.016
SMILESCOc1ccc2CC3N(CC(C)=C)CCC45[C@@H](Oc1c24)c1ncc(cc1C[C@@]35O)-c1ccc(Cl)cc1