Reaction Details
TargetCarbonic anhydrase 4
LigandBDBM50097277
Substrate/Competitorn/a
Meas. Tech.ChEMBL_219473 (CHEMBL824221)
Ki 16±n/a nM
Citation Scozzafava, AMenabuoni, LMincione, FMincione, GSupuran, CT Carbonic anhydrase inhibitors: synthesis of sulfonamides incorporating dtpa tails and of their zinc complexes with powerful topical antiglaucoma properties. Bioorg Med Chem Lett11:575-82 (2001) Carbonic anhydrase 4
Name:Carbonic anhydrase 4
Type:Enzyme
Mol. Mass.:35037.98
Organism:Homo sapiens (Human)
Description:P22748
Residue:312
BDBM50097277
NameBDBM50097277
Synonyms:((2-{Carboxymethyl-[2-(carboxymethyl-{[2-(4-sulfamoyl-phenyl)-ethylcarbamoyl]-methyl}-amino)-ethyl]-amino}-ethyl)-{[2-(4-sulfamoyl-phenyl)-ethylcarbamoyl]-methyl}-amino)-acetic acid CHEMBL1795062 Zinc; ((2-{Carboxymethyl-[2-(carboxymethyl-{[2-(4-sulfamoyl-phenyl)-ethylcarbamoyl]-methyl}-amino)-ethyl]-amino}-ethyl)-{[2-(4-sulfamoyl-phenyl)-ethylcarbamoyl]-methyl}-amino)-acetic acid
TypeSmall organic molecule
Emp. Form.C30H43N7O12S2
Mol. Mass.757.832
SMILESNS(=O)(=O)c1ccc(CCNC(=O)CN(CCN(CCN(CC(O)=O)CC(=O)NCCc2ccc(cc2)S(N)(=O)=O)CC(O)=O)CC(O)=O)cc1