Reaction Details
TargetCarbonic anhydrase 2
LigandBDBM50097280
Substrate/Competitorn/a
Meas. Tech.ChEBML_219472
Ki 64±n/a nM
Citation Scozzafava, AMenabuoni, LMincione, FMincione, GSupuran, CT Carbonic anhydrase inhibitors: synthesis of sulfonamides incorporating dtpa tails and of their zinc complexes with powerful topical antiglaucoma properties. Bioorg Med Chem Lett11:575-82 (2001) Carbonic anhydrase 2
Name:Carbonic anhydrase 2
Type:Enzyme
Mol. Mass.:29250.71
Organism:Homo sapiens (Human)
Description:P00918
Residue:260
BDBM50097280
NameBDBM50097280
Synonyms:CHEMBL284694 Zinc; {{2-[Carboxymethyl-(2-{carboxymethyl-[(4-sulfamoyl-phenylcarbamoyl)-methyl]-amino}-ethyl)-amino]-ethyl}-[(4-sulfamoyl-phenylcarbamoyl)-methyl]-amino}-acetic acid {{2-[Carboxymethyl-(2-{carboxymethyl-[(4-sulfamoyl-phenylcarbamoyl)-methyl]-amino}-ethyl)-amino]-ethyl}-[(4-sulfamoyl-phenylcarbamoyl)-methyl]-amino}-acetic acid; compound with Zn complex
TypeSmall organic molecule
Emp. Form.C26H35N7O12S2
Mol. Mass.701.726
SMILESNS(=O)(=O)c1ccc(NC(=O)CN(CCN(CCN(CC(O)=O)CC(=O)Nc2ccc(cc2)S(N)(=O)=O)CC(O)=O)CC(O)=O)cc1