Reaction Details
TargetCarbonic anhydrase 4
LigandBDBM10864
Substrate/Competitorn/a
Meas. Tech.ChEBML_219473
Ki 66±n/a nM
Citation Scozzafava, AMenabuoni, LMincione, FMincione, GSupuran, CT Carbonic anhydrase inhibitors: synthesis of sulfonamides incorporating dtpa tails and of their zinc complexes with powerful topical antiglaucoma properties. Bioorg Med Chem Lett11:575-82 (2001) Carbonic anhydrase 4
Name:Carbonic anhydrase 4
Type:Enzyme
Mol. Mass.:35037.98
Organism:Homo sapiens (Human)
Description:P22748
Residue:312
BDBM10864
NameBDBM10864
Synonyms:4-Amino-3-bromobenzenesulfonamide CHEMBL6724 halogenosulfanilamide deriv. 5d
TypeSmall organic molecule
Emp. Form.C6H7BrN2O2S
Mol. Mass.251.101
SMILESNc1ccc(cc1Br)S(N)(=O)=O