Reaction Details
TargetCarbonic anhydrase 2
LigandBDBM10867
Substrate/Competitorn/a
Meas. Tech.ChEBML_219472
Ki 75±n/a nM
Citation Scozzafava, AMenabuoni, LMincione, FMincione, GSupuran, CT Carbonic anhydrase inhibitors: synthesis of sulfonamides incorporating dtpa tails and of their zinc complexes with powerful topical antiglaucoma properties. Bioorg Med Chem Lett11:575-82 (2001) Carbonic anhydrase 2
Name:Carbonic anhydrase 2
Type:Enzyme
Mol. Mass.:29250.71
Organism:Homo sapiens (Human)
Description:P00918
Residue:260
BDBM10867
NameBDBM10867
Synonyms:4-amino-6-chlorobenzene-1,3-disulfonamide aromatic/heteroaromatic sulfonamide 12
TypeSmall organic molecule
Emp. Form.C6H8ClN3O4S2
Mol. Mass.285.728
SMILESNc1cc(Cl)c(cc1S(N)(=O)=O)S(N)(=O)=O