Reaction Details
TargetNeuraminidase
LigandBDBM50097651
Substrate/Competitorn/a
Meas. Tech.ChEBML_200639
IC50 420±n/a nM
Citation Wyatt, PGCoomber, BAEvans, DNJack, TIFulton, HEWonacott, AJColman, PVarghese, J Sialidase inhibitors related to zanamivir. Further SAR studies of 4-amino-4H-pyran-2-carboxylic acid-6-propylamides. Bioorg Med Chem Lett11:669-73 (2001) Neuraminidase
Name:Neuraminidase
Type:Enzyme
Mol. Mass.:50124.14
Organism:Influenza A virus (A/Puerto Rico/8/34/Mount Sinai(H1N1))
Description:P03468
Residue:454
BDBM50097651
NameBDBM50097651
Synonyms:(4S,5R,6R)-5-Acetylamino-6-dipropylcarbamoyl-4-ethylamino-5,6-dihydro-4H-pyran-2-carboxylic acid | CHEMBL422016
TypeSmall organic molecule
Emp. Form.C17H29N3O5
Mol. Mass.355.4293
SMILESCCCN(CCC)C(=O)[C@@H]1OC(=C[C@H](NCC)[C@H]1NC(C)=O)C(O)=O