Reaction Details
TargetNeuraminidase
LigandBDBM50097652
Substrate/Competitorn/a
Meas. Tech.ChEBML_200639
IC50 3000±n/a nM
Citation Wyatt, PGCoomber, BAEvans, DNJack, TIFulton, HEWonacott, AJColman, PVarghese, J Sialidase inhibitors related to zanamivir. Further SAR studies of 4-amino-4H-pyran-2-carboxylic acid-6-propylamides. Bioorg Med Chem Lett11:669-73 (2001) Neuraminidase
Name:Neuraminidase
Type:Enzyme
Mol. Mass.:50124.14
Organism:Influenza A virus (A/Puerto Rico/8/34/Mount Sinai(H1N1))
Description:P03468
Residue:454
BDBM50097652
NameBDBM50097652
Synonyms:(4S,5R,6R)-4-Amino-6-dipropylcarbamoyl-5-methanesulfonylamino-5,6-dihydro-4H-pyran-2-carboxylic acid | CHEMBL348995
TypeSmall organic molecule
Emp. Form.C14H25N3O6S
Mol. Mass.363.43
SMILESCCCN(CCC)C(=O)[C@@H]1OC(=C[C@H](N)[C@H]1NS(C)(=O)=O)C(O)=O