Reaction Details
TargetNeuraminidase
LigandBDBM50097649
Substrate/Competitorn/a
Meas. Tech.ChEBML_200639
IC50 17±n/a nM
Citation Wyatt, PGCoomber, BAEvans, DNJack, TIFulton, HEWonacott, AJColman, PVarghese, J Sialidase inhibitors related to zanamivir. Further SAR studies of 4-amino-4H-pyran-2-carboxylic acid-6-propylamides. Bioorg Med Chem Lett11:669-73 (2001) Neuraminidase
Name:Neuraminidase
Type:Enzyme
Mol. Mass.:50124.14
Organism:Influenza A virus (A/Puerto Rico/8/34/Mount Sinai(H1N1))
Description:P03468
Residue:454
BDBM50097649
NameBDBM50097649
Synonyms:(4R,5R,6R)-5-Acetylamino-4-hydroxy-6-(phenethyl-propyl-carbamoyl)-5,6-dihydro-4H-pyran-2-carboxylic acid | CHEMBL350837
TypeSmall organic molecule
Emp. Form.C20H26N2O6
Mol. Mass.390.4302
SMILESCCCN(CCc1ccccc1)C(=O)[C@@H]1OC(=C[C@@H](O)[C@H]1NC(C)=O)C(O)=O