Reaction Details
TargetAdenosine receptor A1
LigandBDBM25400
Substrate/Competitorn/a
Meas. Tech.ChEBML_29331
Ki 230±n/a nM
Citation van Muijlwijk-Koezen, JETimmerman, Hvan der Sluis, RPvan de Stolpe, ACMenge, WMBeukers, MWvan der Graaf, PHde Groote, MIJzerman, AP Synthesis and use of FSCPX, an irreversible adenosine A1 antagonist, as a 'receptor knock-down' tool. Bioorg Med Chem Lett11:815-8 (2001) Adenosine receptor A1
Name:Adenosine receptor A1
Type:Protein
Mol. Mass.:36704.13
Organism:Rattus norvegicus (rat)
Description:n/a
Residue:326
BDBM25400
NameBDBM25400
Synonyms:(2R,3R,4S,5R)-2-[6-(cyclopentylamino)-9H-purin-9-yl]-5-(hydroxymethyl)oxolane-3,4-diol CPA N6-cyclopentyladenosine (CPA) | cid_657378
TypeSmall organic molecule
Emp. Form.C15H21N5O4
Mol. Mass.335.3583
SMILESOC[C@H]1O[C@H]([C@H](O)[C@@H]1O)n1cnc2c(NC3CCCC3)ncnc12