Reaction Details
TargetSomatostatin receptor type 1
LigandBDBM50099173
Substrate/Competitorn/a
Meas. Tech.ChEBML_225192
Ki 1550±n/a nM
Citation Moinet, CContour-Galcéra, MOPoitout, LMorgan, BGordon, TRouber, PThurieau, C Novel non-peptide ligands for the somatostatin sst3 receptor. Bioorg Med Chem Lett11:991-5 (2001) Somatostatin receptor type 1
Name:Somatostatin receptor type 1
Type:Enzyme
Mol. Mass.:42692.81
Organism:Homo sapiens (Human)
Description:P30872
Residue:391
BDBM50099173
NameBDBM50099173
Synonyms:2,4-Difluoro-N-[(R)-2-(1H-indol-3-yl)-1-(4-phenyl-1H-imidazol-2-yl)-ethyl]-benzamidine | CHEMBL175197
TypeSmall organic molecule
Emp. Form.C26H21F2N5
Mol. Mass.441.4752
SMILESNC(=N[C@H](Cc1c[nH]c2ccccc12)c1nc(c[nH]1)-c1ccccc1)c1ccc(F)cc1F