Reaction Details
TargetSomatostatin receptor type 5
LigandBDBM50099177
Substrate/Competitorn/a
Meas. Tech.ChEBML_225196
Ki 1190±n/a nM
Citation Moinet, CContour-Galcéra, MOPoitout, LMorgan, BGordon, TRouber, PThurieau, C Novel non-peptide ligands for the somatostatin sst3 receptor. Bioorg Med Chem Lett11:991-5 (2001) Somatostatin receptor type 5
Name:Somatostatin receptor type 5
Type:Enzyme
Mol. Mass.:39218.02
Organism:Homo sapiens (Human)
Description:P35346
Residue:364
BDBM50099177
NameBDBM50099177
Synonyms:CHEMBL174490 | N-[(R)-2-(1H-Indol-3-yl)-1-(4-phenyl-1H-imidazol-2-yl)-ethyl]-acetamidine
TypeSmall organic molecule
Emp. Form.C21H21N5
Mol. Mass.343.4249
SMILESCC(N)=N[C@H](Cc1c[nH]c2ccccc12)c1nc(c[nH]1)-c1ccccc1