Reaction Details
TargetSomatostatin receptor type 2
LigandBDBM50099169
Substrate/Competitorn/a
Meas. Tech.ChEBML_225193
Ki 5920±n/a nM
Citation Moinet, CContour-Galcéra, MOPoitout, LMorgan, BGordon, TRouber, PThurieau, C Novel non-peptide ligands for the somatostatin sst3 receptor. Bioorg Med Chem Lett11:991-5 (2001) Somatostatin receptor type 2
Name:Somatostatin receptor type 2
Type:Enzyme
Mol. Mass.:41344.94
Organism:Homo sapiens (Human)
Description:P30874
Residue:369
BDBM50099169
NameBDBM50099169
Synonyms:4-tert-Butyl-N-[(R)-2-(1H-indol-3-yl)-1-(4-phenyl-1H-imidazol-2-yl)-ethyl]-benzamidine | CHEMBL176730
TypeSmall organic molecule
Emp. Form.C30H31N5
Mol. Mass.461.6006
SMILESCC(C)(C)c1ccc(cc1)C(N)=N[C@H](Cc1c[nH]c2ccccc12)c1nc(c[nH]1)-c1ccccc1