Reaction Details
TargetSomatostatin receptor type 1
LigandBDBM50099181
Substrate/Competitorn/a
Meas. Tech.ChEBML_225192
Ki 1400±n/a nM
Citation Moinet, CContour-Galcéra, MOPoitout, LMorgan, BGordon, TRouber, PThurieau, C Novel non-peptide ligands for the somatostatin sst3 receptor. Bioorg Med Chem Lett11:991-5 (2001) Somatostatin receptor type 1
Name:Somatostatin receptor type 1
Type:Enzyme
Mol. Mass.:42692.81
Organism:Homo sapiens (Human)
Description:P30872
Residue:391
BDBM50099181
NameBDBM50099181
Synonyms:CHEMBL177337 | [(R)-2-(1H-Indol-3-yl)-1-(4-phenyl-1H-imidazol-2-yl)-ethyl]-carbamic acid benzyl ester
TypeSmall organic molecule
Emp. Form.C27H24N4O2
Mol. Mass.436.5051
SMILESO=C(N[C@H](Cc1c[nH]c2ccccc12)c1nc(c[nH]1)-c1ccccc1)OCc1ccccc1