Reaction Details
TargetSomatostatin receptor type 4
LigandBDBM50099178
Substrate/Competitorn/a
Meas. Tech.ChEBML_225195
Ki 6660±n/a nM
Citation Moinet, CContour-Galcéra, MOPoitout, LMorgan, BGordon, TRouber, PThurieau, C Novel non-peptide ligands for the somatostatin sst3 receptor. Bioorg Med Chem Lett11:991-5 (2001) Somatostatin receptor type 4
Name:Somatostatin receptor type 4
Type:Enzyme
Mol. Mass.:42015.38
Organism:Homo sapiens (Human)
Description:P31391
Residue:388
BDBM50099178
NameBDBM50099178
Synonyms:CHEMBL367699 | N-[(R)-2-(1H-Indol-3-yl)-1-(4-phenyl-1H-imidazol-2-yl)-ethyl]-4-trifluoromethyl-benzamidine
TypeSmall organic molecule
Emp. Form.C27H22F3N5
Mol. Mass.473.4923
SMILESNC(=N[C@H](Cc1c[nH]c2ccccc12)c1nc(c[nH]1)-c1ccccc1)c1ccc(cc1)C(F)(F)F