Reaction Details
TargetSomatostatin receptor type 3
LigandBDBM50099169
Substrate/Competitorn/a
Meas. Tech.ChEBML_225194
Ki 1400±n/a nM
Citation Moinet, CContour-Galcéra, MOPoitout, LMorgan, BGordon, TRouber, PThurieau, C Novel non-peptide ligands for the somatostatin sst3 receptor. Bioorg Med Chem Lett11:991-5 (2001) Somatostatin receptor type 3
Name:Somatostatin receptor type 3
Type:Protein
Mol. Mass.:45855.97
Organism:Homo sapiens (Human)
Description:P32745
Residue:418
BDBM50099169
NameBDBM50099169
Synonyms:4-tert-Butyl-N-[(R)-2-(1H-indol-3-yl)-1-(4-phenyl-1H-imidazol-2-yl)-ethyl]-benzamidine | CHEMBL176730
TypeSmall organic molecule
Emp. Form.C30H31N5
Mol. Mass.461.6006
SMILESCC(C)(C)c1ccc(cc1)C(N)=N[C@H](Cc1c[nH]c2ccccc12)c1nc(c[nH]1)-c1ccccc1