Reaction Details
TargetSomatostatin receptor type 1
LigandBDBM50099183
Substrate/Competitorn/a
Meas. Tech.ChEBML_225192
Ki 5000±n/a nM
Citation Moinet, CContour-Galcéra, MOPoitout, LMorgan, BGordon, TRouber, PThurieau, C Novel non-peptide ligands for the somatostatin sst3 receptor. Bioorg Med Chem Lett11:991-5 (2001) Somatostatin receptor type 1
Name:Somatostatin receptor type 1
Type:Enzyme
Mol. Mass.:42692.81
Organism:Homo sapiens (Human)
Description:P30872
Residue:391
BDBM50099183
NameBDBM50099183
Synonyms:(R)-2-(1H-Indol-3-yl)-1-(4-phenyl-1H-imidazol-2-yl)-ethylamine | CHEMBL173715
TypeSmall organic molecule
Emp. Form.C19H18N4
Mol. Mass.302.373
SMILESN[C@H](Cc1c[nH]c2ccccc12)c1nc(c[nH]1)-c1ccccc1