Reaction Details
TargetSomatostatin receptor type 1
LigandBDBM50099172
Substrate/Competitorn/a
Meas. Tech.ChEBML_225192
Ki 2600±n/a nM
Citation Moinet, CContour-Galcéra, MOPoitout, LMorgan, BGordon, TRouber, PThurieau, C Novel non-peptide ligands for the somatostatin sst3 receptor. Bioorg Med Chem Lett11:991-5 (2001) Somatostatin receptor type 1
Name:Somatostatin receptor type 1
Type:Enzyme
Mol. Mass.:42692.81
Organism:Homo sapiens (Human)
Description:P30872
Residue:391
BDBM50099172
NameBDBM50099172
Synonyms:1-(2,4-Difluoro-phenyl)-3-[(R)-2-(1H-indol-3-yl)-1-(4-phenyl-1H-imidazol-2-yl)-ethyl]-urea | CHEMBL368176
TypeSmall organic molecule
Emp. Form.C26H21F2N5O
Mol. Mass.457.4746
SMILESFc1ccc(NC(=O)N[C@H](Cc2c[nH]c3ccccc23)c2nc(c[nH]2)-c2ccccc2)c(F)c1