Reaction Details
TargetAlpha-2A adrenergic receptor
LigandBDBM50099325
Substrate/Competitorn/a
Meas. Tech.ChEBML_33061
Ki 83±n/a nM
Citation Carroll, WASippy, KBEsbenshade, TABuckner, SAHancock, AAMeyer, MD Two novel and potent 3-[(o-methoxyphenyl)piperazinylethyl]-5-phenylthien. Bioorg Med Chem Lett11:1119-21 (2001) Alpha-2A adrenergic receptor
Name:Alpha-2A adrenergic receptor
Type:Enzyme
Mol. Mass.:48979.91
Organism:Homo sapiens (Human)
Description:P08913
Residue:465
BDBM50099325
NameBDBM50099325
Synonyms:3-{2-[4-(2-Methoxy-phenyl)-piperazin-1-yl]-ethyl}-5-m-tolyl-1H-thieno[2,3-d]pyrimidine-2,4-dione CHEMBL13856
TypeSmall organic molecule
Emp. Form.C26H28N4O3S
Mol. Mass.476.591
SMILESCOc1ccccc1N1CCN(CCn2c(=O)[nH]c3scc(-c4cccc(C)c4)c3c2=O)CC1