Reaction Details
TargetAlpha-1A adrenergic receptor
LigandBDBM50099321
Substrate/Competitorn/a
Meas. Tech.ChEBML_33587
Ki 0.377000±n/a nM
Citation Carroll, WASippy, KBEsbenshade, TABuckner, SAHancock, AAMeyer, MD Two novel and potent 3-[(o-methoxyphenyl)piperazinylethyl]-5-phenylthien. Bioorg Med Chem Lett11:1119-21 (2001) Alpha-1A adrenergic receptor
Name:Alpha-1A adrenergic receptor
Type:Enzyme Catalytic Domain
Mol. Mass.:51492.08
Organism:CALF
Description:adrenergic Alpha1 0 CALF
Residue:466
BDBM50099321
NameBDBM50099321
Synonyms:3-{2-[4-(2-Methoxy-phenyl)-piperazin-1-yl]-ethyl}-6-methyl-5-phenyl-1H-thieno[2,3-d]pyrimidine-2,4-dione | CHEMBL13754
TypeSmall organic molecule
Emp. Form.C26H28N4O3S
Mol. Mass.476.591
SMILESCOc1ccccc1N1CCN(CCn2c(=O)[nH]c3sc(C)c(-c4ccccc4)c3c2=O)CC1