Reaction Details
TargetGag-Pol polyprotein [489-587]
LigandBDBM50061306
Substrate/Competitorn/a
Meas. Tech.ChEMBL_79805 (CHEMBL696065)
IC50 530±n/a nM
Citation Murphy, PVO'Brien, JLGorey-Feret, LJSmith, AB Structure-based design and synthesis of HIV-1 protease inhibitors employing beta-D-mannopyranoside scaffolds. Bioorg Med Chem Lett12:1763-6 (2002) Gag-Pol polyprotein [489-587]
Name:Gag-Pol polyprotein [489-587]
Type:Enzyme Subunit
Mol. Mass.:10781.16
Organism:Human immunodeficiency virus type 1
Description:P04585[489-587]
Residue:99
BDBM50061306
NameBDBM50061306
Synonyms:(3S,4aS,8aS)-2-[(2R,3R)-2-Hydroxy-3-(3-hydroxy-2-methyl-benzoylamino)-4-phenylsulfanyl-butyl]-decahydro-isoquinoline-3-carboxylic acid tert-butylamide; compound with methanesulfonic acid CHEMBL1205 Nelfinavir cmdc.202100576, 24h
TypeSmall organic molecule
Emp. Form.C32H45N3O4S
Mol. Mass.567.782
SMILESCc1c(O)cccc1C(=O)N[C@@H](CSc1ccccc1)[C@H](O)CN1C[C@H]2CCCC[C@H]2C[C@H]1C(=O)NC(C)(C)C