Reaction Details
TargetGag-Pol polyprotein [489-587]
LigandBDBM50114968
Substrate/Competitorn/a
Meas. Tech.ChEBML_79805
IC50 4660±n/a nM
Citation Murphy, PVO'Brien, JLGorey-Feret, LJSmith, AB Structure-based design and synthesis of HIV-1 protease inhibitors employing beta-D-mannopyranoside scaffolds. Bioorg Med Chem Lett12:1763-6 (2002) Gag-Pol polyprotein [489-587]
Name:Gag-Pol polyprotein [489-587]
Type:Enzyme Subunit
Mol. Mass.:10781.16
Organism:Human immunodeficiency virus type 1
Description:P04585[489-587]
Residue:99
BDBM50114968
NameBDBM50114968
Synonyms:((3R,5R,6R)-4-Benzyloxy-3,5-dihydroxy-6-methoxy-tetrahydro-pyran-2-ylmethyl)-carbamic acid benzyl ester | CHEMBL50563
TypeSmall organic molecule
Emp. Form.C22H27NO7
Mol. Mass.417.4523
SMILESCO[C@@H]1OC(CNC(=O)OCc2ccccc2)[C@@H](O)C(OCc2ccccc2)[C@H]1O