Reaction Details
TargetGag-Pol polyprotein [489-587]
LigandBDBM50114970
Substrate/Competitorn/a
Meas. Tech.ChEBML_79805
IC50 4850±n/a nM
Citation Murphy, PVO'Brien, JLGorey-Feret, LJSmith, AB Structure-based design and synthesis of HIV-1 protease inhibitors employing beta-D-mannopyranoside scaffolds. Bioorg Med Chem Lett12:1763-6 (2002) Gag-Pol polyprotein [489-587]
Name:Gag-Pol polyprotein [489-587]
Type:Enzyme Subunit
Mol. Mass.:10781.16
Organism:Human immunodeficiency virus type 1
Description:P04585[489-587]
Residue:99
BDBM50114970
NameBDBM50114970
Synonyms:(6R,7R,8aR)-8-Benzyloxy-6-methoxy-2-phenyl-hexahydro-pyrano[3,2-d][1,3]dioxin-7-ol | CHEMBL50700
TypeSmall organic molecule
Emp. Form.C21H24O6
Mol. Mass.372.4117
SMILESCO[C@@H]1OC2COC(O[C@H]2C(OCc2ccccc2)[C@H]1O)c1ccccc1