Reaction Details
TargetSubstance-K receptor
LigandBDBM50116076
Substrate/Competitorn/a
Meas. Tech.ChEBML_209384
Ki 0.300000±n/a nM
Citation Ting, PCLee, JFShih, NYPiwinski, JJAnthes, JCChapman, RWRizzo, CAHey, JANg, KNomeir, AA Identification of a novel 1'-[5-((3,5-dichlorobenzoyl)methylamino)-3-(3,4-dichlorophenyl)-4-(methoxyimino)pentyl]-2-oxo-(1,4'-bipiperidine) as a dual NK(1)/NK(2) antagonist. Bioorg Med Chem Lett12:2125-8 (2002) Substance-K receptor
Name:Substance-K receptor
Type:Enzyme Catalytic Domain
Mol. Mass.:45106.00
Organism:GUINEA PIG
Description:Neurokinin NK2 TACR2 GUINEA PIG::Q64077
Residue:402
BDBM50116076
NameBDBM50116076
Synonyms:CHEMBL441252 | N-[5-(3-Carbamoylmethyl-2-oxo-[1,4']bipiperidinyl-1'-yl)-3-(3,4-dichloro-phenyl)-2-methoxyimino-pentyl]-3,5-dichloro-N-ethyl-benzamide
TypeSmall organic molecule
Emp. Form.C32H39Cl4N5O4
Mol. Mass.699.495
SMILESCO\N=C(/CN(C)C(=O)c1cc(Cl)cc(Cl)c1)[C@H](CCN1CCC(CC1)N1CCCC(CC(N)=O)C1=O)c1ccc(Cl)c(Cl)c1