Reaction Details
TargetProtein farnesyltransferase subunit beta/geranylgeranyltransferase type-1 subunit alpha
LigandBDBM50108509
Substrate/Competitorn/a
Meas. Tech.ChEMBL_70296 (CHEMBL679698)
IC50 9000±n/a nM
Citation Marson, CMRioja, ASBrooke, GCoombes, RCVigushin, DM Cyclic acid anhydrides as a new class of potent, selective and non-peptidic inhibitors of geranylgeranyl transferase. Bioorg Med Chem Lett12:255-9 (2001) Protein farnesyltransferase subunit beta/geranylgeranyltransferase type-1 subunit alpha
Name:Protein farnesyltransferase subunit beta/geranylgeranyltransferase type-1 subunit alpha
Type:Protein Complex
Mol. Mass.:n/a
Description:To express recombinant enzyme in E. coli, the cloned human alpha and beta subunits were co-expressed from a plasmid, in which their expression was translationally coupled.
Components:This complex has 2 components.
Component 1
Name:Protein farnesyltransferase subunit beta
Synonyms:CAAX farnesyltransferase subunit alpha FNTB FTase-alpha GGTase-I-alpha Protein farnesyl/geranylgeranyl transferase Protein farnesyltransferase subunit beta Protein farnesyltransferase/geranylgeranyltransferase type-1 subunit alpha Ras proteins prenyltransferase subunit beta | Type I protein geranyl-geranyltransferase subunit alpha
Type:Enzyme Subunit
Mol. Mass.:48766.02
Organism:Homo sapiens (Human)
Description:Protein farnesyltransferase subunit beta
Residue:437
Component 2
Name:Protein farnesyltransferase/geranylgeranyltransferase type-1 subunit alpha
Synonyms:CAAX farnesyltransferase alpha subunit FNTA_HUMAN FTase-alpha Geranylgeranyl Transferase (GGTase-I) Chain A Protein Farnesyltransferase (PFT) Chain A Protein farnesyltransferase Protein farnesyltransferase/geranylgeranyltransferase type I alpha subunit | Ras proteins prenyltransferase alpha
Type:Enzyme
Mol. Mass.:44392.46
Organism:Homo sapiens (Human)
Description:Recombinant human FTase.
Residue:379
BDBM50108509
NameBDBM50108509
Synonyms:5-((E)-4,8-Dimethyl-nona-3,7-dienyl)-3a,4,7,7a-tetrahydro-isobenzofuran-1,3-dione | CHEMBL82796
TypeSmall organic molecule
Emp. Form.C19H26O3
Mol. Mass.302.4079
SMILES[#6]\[#6](-[#6])=[#6]\[#6]-[#6]\[#6](-[#6])=[#6]\[#6]-[#6]-[#6]-1=[#6]-[#6]-[#6]-2-[#6](-[#6]-1)-[#6](=O)-[#8]-[#6]-2=O