Reaction Details
TargetTissue alpha-L-fucosidase
LigandBDBM50118921
Substrate/Competitorn/a
Meas. Tech.ChEBML_33957
Ki 48±n/a nM
Citation Ogawa, SMori, MTakeuchi, GDoi, FWatanabe, MSakata, Y Convenient synthesis and evaluation of enzyme inhibitory activity of several N-alkyl-, N-phenylalkyl, and cyclic isourea derivatives of 5a-carba-alpha-DL-fucopyranosylamine. Bioorg Med Chem Lett12:2811-4 (2002) Tissue alpha-L-fucosidase
Name:Tissue alpha-L-fucosidase
Type:PROTEIN
Mol. Mass.:53690.69
Organism:Homo sapiens (Human)
Description:ChEMBL_34088
Residue:466
BDBM50118921
NameBDBM50118921
Synonyms:(1R,2S,3S)-4-Heptylamino-6-methyl-cyclohexane-1,2,3-triol | CHEMBL95110
TypeSmall organic molecule
Emp. Form.C14H29NO3
Mol. Mass.259.385
SMILESCCCCCCCNC1CC(C)C(O)C(O)C1O