Reaction Details
TargetDelta-type opioid receptor
LigandBDBM50120168
Substrate/Competitorn/a
Meas. Tech.ChEBML_145476
Ki 8819±n/a nM
Citation Wu, WLCaplen, MADomalski, MSZhang, HFawzi, ABurnett, DA Synthesis and structure-activity relationships of aminoalkylazetidines as ORL1 receptor ligands. Bioorg Med Chem Lett12:3157-60 (2002) Delta-type opioid receptor
Name:Delta-type opioid receptor
Type:G Protein-Coupled Receptor (GPCR)
Mol. Mass.:40382.98
Organism:Homo sapiens (Human)
Description:Competition binding assays were carried out using membrane preparations from transfected HN9.10 cells that constitutively expressed the delta opioid receptor.
Residue:372
BDBM50120168
NameBDBM50120168
Synonyms:C-{(S)-C-(3-Chloro-phenyl)-C-[(S)-1-(1-phenyl-pentyl)-azetidin-2-yl]}-methylamine | CHEMBL107288
TypeSmall organic molecule
Emp. Form.C21H27ClN2
Mol. Mass.342.905
SMILESCCCCC(N1CC[C@H]1[C@@H](N)c1cccc(Cl)c1)c1ccccc1