Reaction Details
TargetDelta-type opioid receptor
LigandBDBM50120143
Substrate/Competitorn/a
Meas. Tech.ChEBML_145476
Ki 7430±n/a nM
Citation Wu, WLCaplen, MADomalski, MSZhang, HFawzi, ABurnett, DA Synthesis and structure-activity relationships of aminoalkylazetidines as ORL1 receptor ligands. Bioorg Med Chem Lett12:3157-60 (2002) Delta-type opioid receptor
Name:Delta-type opioid receptor
Type:G Protein-Coupled Receptor (GPCR)
Mol. Mass.:40382.98
Organism:Homo sapiens (Human)
Description:Competition binding assays were carried out using membrane preparations from transfected HN9.10 cells that constitutively expressed the delta opioid receptor.
Residue:372
BDBM50120143
NameBDBM50120143
Synonyms:C-[(R)-C-{(S)-1-[Bis-(4-fluoro-phenyl)-methyl]-azetidin-2-yl}-C-(3-chloro-phenyl)]-methylamine | CHEMBL321462
TypeSmall organic molecule
Emp. Form.C23H21ClF2N2
Mol. Mass.398.876
SMILESN[C@@H]([C@@H]1CCN1C(c1ccc(F)cc1)c1ccc(F)cc1)c1cccc(Cl)c1