Reaction Details
TargetDelta-type opioid receptor
LigandBDBM50120165
Substrate/Competitorn/a
Meas. Tech.ChEBML_145476
Ki 2919±n/a nM
Citation Wu, WLCaplen, MADomalski, MSZhang, HFawzi, ABurnett, DA Synthesis and structure-activity relationships of aminoalkylazetidines as ORL1 receptor ligands. Bioorg Med Chem Lett12:3157-60 (2002) Delta-type opioid receptor
Name:Delta-type opioid receptor
Type:G Protein-Coupled Receptor (GPCR)
Mol. Mass.:40382.98
Organism:Homo sapiens (Human)
Description:Competition binding assays were carried out using membrane preparations from transfected HN9.10 cells that constitutively expressed the delta opioid receptor.
Residue:372
BDBM50120165
NameBDBM50120165
Synonyms:C-[(S)-C-((S)-1-Benzhydryl-azetidin-2-yl)-C-(4-methoxy-phenyl)]-methylamine | CHEMBL448155
TypeSmall organic molecule
Emp. Form.C24H26N2O
Mol. Mass.358.476
SMILESCOc1ccc(cc1)[C@H](N)[C@@H]1CCN1C(c1ccccc1)c1ccccc1