Reaction Details
TargetDelta-type opioid receptor
LigandBDBM50120167
Substrate/Competitorn/a
Meas. Tech.ChEBML_145476
Ki 634±n/a nM
Citation Wu, WLCaplen, MADomalski, MSZhang, HFawzi, ABurnett, DA Synthesis and structure-activity relationships of aminoalkylazetidines as ORL1 receptor ligands. Bioorg Med Chem Lett12:3157-60 (2002) Delta-type opioid receptor
Name:Delta-type opioid receptor
Type:G Protein-Coupled Receptor (GPCR)
Mol. Mass.:40382.98
Organism:Homo sapiens (Human)
Description:Competition binding assays were carried out using membrane preparations from transfected HN9.10 cells that constitutively expressed the delta opioid receptor.
Residue:372
BDBM50120167
NameBDBM50120167
Synonyms:C-[(S)-C-((S)-1-Benzhydryl-azetidin-2-yl)-C-(3-fluoro-4-methyl-phenyl)]-methylamine | CHEMBL108894
TypeSmall organic molecule
Emp. Form.C24H25FN2
Mol. Mass.360.4671
SMILESCc1ccc(cc1F)[C@H](N)[C@@H]1CCN1C(c1ccccc1)c1ccccc1