Reaction Details
TargetDelta-type opioid receptor
LigandBDBM50120148
Substrate/Competitorn/a
Meas. Tech.ChEBML_145476
Ki 9372±n/a nM
Citation Wu, WLCaplen, MADomalski, MSZhang, HFawzi, ABurnett, DA Synthesis and structure-activity relationships of aminoalkylazetidines as ORL1 receptor ligands. Bioorg Med Chem Lett12:3157-60 (2002) Delta-type opioid receptor
Name:Delta-type opioid receptor
Type:G Protein-Coupled Receptor (GPCR)
Mol. Mass.:40382.98
Organism:Homo sapiens (Human)
Description:Competition binding assays were carried out using membrane preparations from transfected HN9.10 cells that constitutively expressed the delta opioid receptor.
Residue:372
BDBM50120148
NameBDBM50120148
Synonyms:C-((S)-C-(3-Chloro-phenyl)-C-{(S)-1-[1-(3,5-difluoro-phenyl)-pentyl]-azetidin-2-yl})-methylamine | CHEMBL324895
TypeSmall organic molecule
Emp. Form.C21H25ClF2N2
Mol. Mass.378.886
SMILESCCCCC(N1CC[C@H]1[C@@H](N)c1cccc(Cl)c1)c1cc(F)cc(F)c1