Reaction Details
TargetNociceptin receptor
LigandBDBM50120156
Substrate/Competitorn/a
Meas. Tech.ChEBML_145007
Ki 37±n/a nM
Citation Wu, WLCaplen, MADomalski, MSZhang, HFawzi, ABurnett, DA Synthesis and structure-activity relationships of aminoalkylazetidines as ORL1 receptor ligands. Bioorg Med Chem Lett12:3157-60 (2002) Nociceptin receptor
Name:Nociceptin receptor
Type:G Protein-Coupled Receptor (GPCR)
Mol. Mass.:40702.87
Organism:Homo sapiens (Human)
Description:P41146
Residue:370
BDBM50120156
NameBDBM50120156
Synonyms:C-[(S)-C-((S)-1-Benzhydryl-azetidin-2-yl)-C-(3-chloro-phenyl)]-methylamine | CHEMBL324635
TypeSmall organic molecule
Emp. Form.C23H23ClN2
Mol. Mass.362.895
SMILESN[C@H]([C@@H]1CCN1C(c1ccccc1)c1ccccc1)c1cccc(Cl)c1