Reaction Details
TargetMu-type opioid receptor
LigandBDBM50120159
Substrate/Competitorn/a
Meas. Tech.ChEBML_148100
Ki 3452±n/a nM
Citation Wu, WLCaplen, MADomalski, MSZhang, HFawzi, ABurnett, DA Synthesis and structure-activity relationships of aminoalkylazetidines as ORL1 receptor ligands. Bioorg Med Chem Lett12:3157-60 (2002) Mu-type opioid receptor
Name:Mu-type opioid receptor
Type:G Protein-Coupled Receptor (GPCR)
Mol. Mass.:44789.51
Organism:Homo sapiens (Human)
Description:P35372
Residue:400
BDBM50120159
NameBDBM50120159
Synonyms:C-[(R)-C-{(S)-1-[Bis-(4-chloro-phenyl)-methyl]-azetidin-2-yl}-C-(3-chloro-phenyl)]-methylamine | CHEMBL106785
TypeSmall organic molecule
Emp. Form.C23H21Cl3N2
Mol. Mass.431.785
SMILESN[C@@H]([C@@H]1CCN1C(c1ccc(Cl)cc1)c1ccc(Cl)cc1)c1cccc(Cl)c1