Reaction Details
TargetMu-type opioid receptor
LigandBDBM50120142
Substrate/Competitorn/a
Meas. Tech.ChEBML_148100
Ki 5401±n/a nM
Citation Wu, WLCaplen, MADomalski, MSZhang, HFawzi, ABurnett, DA Synthesis and structure-activity relationships of aminoalkylazetidines as ORL1 receptor ligands. Bioorg Med Chem Lett12:3157-60 (2002) Mu-type opioid receptor
Name:Mu-type opioid receptor
Type:G Protein-Coupled Receptor (GPCR)
Mol. Mass.:44789.51
Organism:Homo sapiens (Human)
Description:P35372
Residue:400
BDBM50120142
NameBDBM50120142
Synonyms:C-[(S)-C-((S)-1-Benzhydryl-azetidin-2-yl)-C-(4-phenoxy-phenyl)]-methylamine | CHEMBL106043
TypeSmall organic molecule
Emp. Form.C29H28N2O
Mol. Mass.420.5454
SMILESN[C@H]([C@@H]1CCN1C(c1ccccc1)c1ccccc1)c1ccc(Oc2ccccc2)cc1