Reaction Details
TargetNociceptin receptor
LigandBDBM50120141
Substrate/Competitorn/a
Meas. Tech.ChEBML_145007
Ki 1345±n/a nM
Citation Wu, WLCaplen, MADomalski, MSZhang, HFawzi, ABurnett, DA Synthesis and structure-activity relationships of aminoalkylazetidines as ORL1 receptor ligands. Bioorg Med Chem Lett12:3157-60 (2002) Nociceptin receptor
Name:Nociceptin receptor
Type:G Protein-Coupled Receptor (GPCR)
Mol. Mass.:40702.87
Organism:Homo sapiens (Human)
Description:P41146
Residue:370
BDBM50120141
NameBDBM50120141
Synonyms:C-[(S)-C-[(S)-1-(1-Butyl-pentyl)-azetidin-2-yl]-C-(3-chloro-phenyl)]-methylamine | CHEMBL106359
TypeSmall organic molecule
Emp. Form.C19H31ClN2
Mol. Mass.322.916
SMILESCCCCC(CCCC)N1CC[C@H]1[C@@H](N)c1cccc(Cl)c1