Reaction Details
TargetKappa-type opioid receptor
LigandBDBM50120143
Substrate/Competitorn/a
Meas. Tech.ChEBML_145246
Ki 2240±n/a nM
Citation Wu, WLCaplen, MADomalski, MSZhang, HFawzi, ABurnett, DA Synthesis and structure-activity relationships of aminoalkylazetidines as ORL1 receptor ligands. Bioorg Med Chem Lett12:3157-60 (2002) Kappa-type opioid receptor
Name:Kappa-type opioid receptor
Type:G Protein-Coupled Receptor (GPCR)
Mol. Mass.:42648.76
Organism:Homo sapiens (Human)
Description:P41145
Residue:380
BDBM50120143
NameBDBM50120143
Synonyms:C-[(R)-C-{(S)-1-[Bis-(4-fluoro-phenyl)-methyl]-azetidin-2-yl}-C-(3-chloro-phenyl)]-methylamine | CHEMBL321462
TypeSmall organic molecule
Emp. Form.C23H21ClF2N2
Mol. Mass.398.876
SMILESN[C@@H]([C@@H]1CCN1C(c1ccc(F)cc1)c1ccc(F)cc1)c1cccc(Cl)c1