Reaction Details
TargetMu-type opioid receptor
LigandBDBM50120164
Substrate/Competitorn/a
Meas. Tech.ChEBML_148100
Ki 8067±n/a nM
Citation Wu, WLCaplen, MADomalski, MSZhang, HFawzi, ABurnett, DA Synthesis and structure-activity relationships of aminoalkylazetidines as ORL1 receptor ligands. Bioorg Med Chem Lett12:3157-60 (2002) Mu-type opioid receptor
Name:Mu-type opioid receptor
Type:G Protein-Coupled Receptor (GPCR)
Mol. Mass.:44789.51
Organism:Homo sapiens (Human)
Description:P35372
Residue:400
BDBM50120164
NameBDBM50120164
Synonyms:C-{(S)-C-(3-Chloro-phenyl)-C-[(S)-1-(1-phenyl-propyl)-azetidin-2-yl]}-methylamine | CHEMBL106235
TypeSmall organic molecule
Emp. Form.C19H23ClN2
Mol. Mass.314.852
SMILESCCC(N1CC[C@H]1[C@@H](N)c1cccc(Cl)c1)c1ccccc1