Reaction Details
TargetNociceptin receptor
LigandBDBM50120152
Substrate/Competitorn/a
Meas. Tech.ChEBML_145007
Ki 2532±n/a nM
Citation Wu, WLCaplen, MADomalski, MSZhang, HFawzi, ABurnett, DA Synthesis and structure-activity relationships of aminoalkylazetidines as ORL1 receptor ligands. Bioorg Med Chem Lett12:3157-60 (2002) Nociceptin receptor
Name:Nociceptin receptor
Type:G Protein-Coupled Receptor (GPCR)
Mol. Mass.:40702.87
Organism:Homo sapiens (Human)
Description:P41146
Residue:370
BDBM50120152
NameBDBM50120152
Synonyms:C-[(R)-C-{(S)-1-[Bis-(4-bromo-phenyl)-methyl]-azetidin-2-yl}-C-(3-chloro-phenyl)]-methylamine | CHEMBL320582
TypeSmall organic molecule
Emp. Form.C23H21Br2ClN2
Mol. Mass.520.687
SMILESN[C@@H]([C@@H]1CCN1C(c1ccc(Br)cc1)c1ccc(Br)cc1)c1cccc(Cl)c1