Reaction Details
TargetMu-type opioid receptor
LigandBDBM50120145
Substrate/Competitorn/a
Meas. Tech.ChEBML_148100
Ki 6015±n/a nM
Citation Wu, WLCaplen, MADomalski, MSZhang, HFawzi, ABurnett, DA Synthesis and structure-activity relationships of aminoalkylazetidines as ORL1 receptor ligands. Bioorg Med Chem Lett12:3157-60 (2002) Mu-type opioid receptor
Name:Mu-type opioid receptor
Type:G Protein-Coupled Receptor (GPCR)
Mol. Mass.:44789.51
Organism:Homo sapiens (Human)
Description:P35372
Residue:400
BDBM50120145
NameBDBM50120145
Synonyms:C-{(R)-C-(3-Chloro-phenyl)-C-[(S)-1-(1-phenyl-butyl)-azetidin-2-yl]}-methylamine | CHEMBL106366
TypeSmall organic molecule
Emp. Form.C20H25ClN2
Mol. Mass.328.879
SMILESCCCC(N1CC[C@H]1[C@H](N)c1cccc(Cl)c1)c1ccccc1