Reaction Details
TargetD(2) dopamine receptor
LigandBDBM50109020
Substrate/Competitorn/a
Meas. Tech.ChEMBL_62080 (CHEMBL672379)
Ki 7±n/a nM
Citation Mewshaw, REZhao, RShi, XMarquis, KBrennan, JAMazandarani, HCoupet, JAndree, TH New generation dopaminergic agents. Part 8: heterocyclic bioisosteres that exploit the 7-OH-2-(aminomethyl)chroman D(2) template. Bioorg Med Chem Lett12:271-4 (2002) D(2) dopamine receptor
Name:D(2) dopamine receptor
Type:G Protein-Coupled Receptor (GPCR)
Mol. Mass.:50931.60
Organism:Rattus norvegicus (rat)
Description:P61169
Residue:444
BDBM50109020
NameBDBM50109020
Synonyms:8-(Benzylamino-methyl)-3,6,7,8-tetrahydro-1H-chromeno[7,8-d]imidazol-2-one | CHEMBL93779
TypeSmall organic molecule
Emp. Form.C18H19N3O2
Mol. Mass.309.3624
SMILESO=c1[nH]c2ccc3CCC(CNCc4ccccc4)Oc3c2[nH]1