Reaction Details
TargetD(2) dopamine receptor
LigandBDBM50077569
Substrate/Competitorn/a
Meas. Tech.ChEBML_62080
Ki 1.9±n/a nM
Citation Mewshaw, REZhao, RShi, XMarquis, KBrennan, JAMazandarani, HCoupet, JAndree, TH New generation dopaminergic agents. Part 8: heterocyclic bioisosteres that exploit the 7-OH-2-(aminomethyl)chroman D(2) template. Bioorg Med Chem Lett12:271-4 (2002) D(2) dopamine receptor
Name:D(2) dopamine receptor
Type:G Protein-Coupled Receptor (GPCR)
Mol. Mass.:50931.60
Organism:Rattus norvegicus (rat)
Description:P61169
Residue:444
BDBM50077569
NameBDBM50077569
Synonyms:Benzyl-[(R)-1-(2,3,4,7-tetrahydro-pyrano[2,3-e]indol-2-yl)methyl]-amine | CHEMBL60185
TypeSmall organic molecule
Emp. Form.C19H20N2O
Mol. Mass.292.3749
SMILESC(NCc1ccccc1)[C@H]1CCc2ccc3[nH]ccc3c2O1